{"text_format":"1","workbook":"xlsx","n_sheets":13,"sheets":["生産履歴票","データ1","データ2","生産履歴票設定","台帳作成","品種台帳","ほ場台帳","作業台帳","機械台帳","農薬台帳","肥料台帳","生産履歴票設定保存","作業用"],"not_rendered":{"charts":0,"images":10,"macros":1,"external_links":0,"defined_names":1,"comments":0,"pivot_tables":0},"unopened":[],"bounds":{"document_bytes":16777216,"sheet_cells":100000,"rows_first":2000,"rows_last":500,"rows_between":2000,"halvings":0,"cell_chars":16384,"cell_head_chars":4096},"cells_cut":0,"cells_raw":0,"read":"whole","date_system":"1900"}

{"sheet":"生産履歴票","index":0,"n_rows":1086,"n_cols":9,"rows_kept":1086,"cut":false,"hidden":false,"merged":[[5,1,5,2],[6,1,6,2],[3,1,3,2],[4,1,4,2]]}
["生産履歴票"]
["年度"]
["作目名"]
["品種名"]
["ほ場番号"]
["ほ場名",{"$f":"IF(B5=\"\",\"\",IF(VLOOKUP(B5,ほ場台帳!$C$5:$H$1001,2,0)=\"\",\"\",VLOOKUP(B5,ほ場台帳!$C$5:$H$1001,2,0)))","v":""}]
["地番",{"$f":"IF(B5=\"\",\"\",IF(VLOOKUP(B5,ほ場台帳!$C$5:$H$1001,3,0)=\"\",\"\",VLOOKUP(B5,ほ場台帳!$C$5:$H$1001,3,0)))","v":""}]
["面積",{"$f":"IF(B5=\"\",\"\",IF(VLOOKUP(B5,ほ場台帳!$C$5:$H$1001,4,0)=\"\",\"\",VLOOKUP(B5,ほ場台帳!$C$5:$H$1001,4,0)))","v":""}]
[]
[]
[]
[]
[]
[]
[]
[]
[]
[]
[]
[]
[]
[]
[]
[]
[]
[]
[]
[]
[]
[]
[]
[]
[]
[]
[]
[]
[]
[]
[]
[]
{"$rows_left_out":1047}
{"sheet":"データ1","index":1,"n_rows":0,"n_cols":0,"rows_kept":0,"cut":false,"hidden":false,"merged":[]}

{"sheet":"データ2","index":2,"n_rows":0,"n_cols":0,"rows_kept":0,"cut":false,"hidden":false,"merged":[]}

{"sheet":"生産履歴票設定","index":3,"n_rows":177,"n_cols":37,"rows_kept":177,"cut":false,"hidden":false,"merged":[[79,0,80,1],[15,0,15,1],[7,0,8,0],[16,0,18,0],[11,0,14,0],[9,0,10,1],[114,0,115,1],[19,0,21,0],[54,0,56,0],[89,0,91,0],[124,0,126,0],[86,0,88,0],[112,0,113,0],[51,0,53,0],[42,0,43,0],[46,0,49,0],[50,0,50,1],[44,0,45,1],[116,0,119,0],[77,0,78,0],[81,0,84,0],[85,0,85,1],[159,0,161,0],[151,0,154,0],[155,0,155,1],[156,0,158,0],[120,0,120,1],[121,0,123,0],[147,0,148,0],[149,0,150,1]]}
["生産履歴票作成の詳細設定"]
[]
["フォーマット選択"]
[]
["工程区分１"]
["工程区分名"]
["データシート"]
["対象作業"]
[null,null,null,null,null,null,null,null,null,null,null,null,null,null,null,null,null,null,null,null,null,null,null,null,null,null,null,null,null,"列記号２",null,null,null,null,null,"列記号３"]
["生産履歴票に記載する項目名",null,"項目1","項目2","項目3","項目4","項目5","項目6",null,null,null,null,null,null,null,null,null,null,null,null,null,null,null,null,null,null,null,null,null,null,null,null,"ほ場台帳","作業台帳","機械台帳","農薬台帳","肥料台帳"]
[null,null,null,null,null,null,null,null,null,null,null,null,null,null,null,null,null,null,null,null,null,null,null,null,null,null,null,null,null,null,"ほ場台帳",2,{"$f":"IF(ほ場台帳!A$3=\"\",\"\",ほ場台帳!A$3)","v":"データ１"},{"$f":"IF(作業台帳!A$4=\"\",\"\",作業台帳!A$4)","v":"データ１"},{"$f":"IF(機械台帳!A$4=\"\",\"\",機械台帳!A$4)","v":"データ１"},{"$f":"IF(農薬台帳!A$4=\"\",\"\",農薬台帳!A$4)","v":"データ１"},{"$f":"IF(肥料台帳!A$4=\"\",\"\",肥料台帳!A$4)","v":"データ１"}]
["データシート\nの列記号","列記号１",null,null,null,null,null,null,null,{"$f":"IF(C12=\"\",\"\",ASC(C12))","v":""},"","","","","",null,null,null,null,null,null,null,null,null,null,null,null,null,null,null,"作業台帳",3,{"$f":"IF(ほ場台帳!B$3=\"\",\"\",ほ場台帳!B$3)","v":"データ２"},{"$f":"IF(作業台帳!B$4=\"\",\"\",作業台帳!B$4)","v":"データ２"},{"$f":"IF(機械台帳!B$4=\"\",\"\",機械台帳!B$4)","v":"データ２"},{"$f":"IF(農薬台帳!B$4=\"\",\"\",農薬台帳!B$4)","v":"データ２"},{"$f":"IF(肥料台帳!B$4=\"\",\"\",肥料台帳!B$4)","v":"データ２"}]
[null,"列記号２",null,null,null,null,null,null,null,{"$f":"IF(C13=\"\",\"\",ASC(C13))","v":""},"","","","","",null,null,null,null,null,null,null,null,null,null,null,null,null,null,null,"機械台帳",4,{"$f":"IF(ほ場台帳!C$3=\"\",\"\",ほ場台帳!C$3)","v":"ほ場番号"},{"$f":"IF(作業台帳!C$4=\"\",\"\",作業台帳!C$4)","v":"作業名"},{"$f":"IF(機械台帳!C$4=\"\",\"\",機械台帳!C$4)","v":"機械名"},{"$f":"IF(農薬台帳!C$4=\"\",\"\",農薬台帳!C$4)","v":"農薬名"},{"$f":"IF(肥料台帳!C$4=\"\",\"\",肥料台帳!C$4)","v":"肥料名"}]
[null,"列記号３",null,null,null,null,null,null,null,{"$f":"IF(C14=\"\",\"\",ASC(C14))","v":""},"","","","","",null,null,null,null,null,null,null,null,null,null,null,null,null,null,null,"農薬台帳",5,{"$f":"IF(ほ場台帳!D$3=\"\",\"\",ほ場台帳!D$3)","v":"ほ場名"},{"$f":"IF(作業台帳!D$4=\"\",\"\",作業台帳!D$4)","v":"機械名"},{"$f":"IF(機械台帳!D$4=\"\",\"\",機械台帳!D$4)","v":""},{"$f":"IF(農薬台帳!D$4=\"\",\"\",農薬台帳!D$4)","v":"区分"},{"$f":"IF(肥料台帳!D$4=\"\",\"\",肥料台帳!D$4)","v":"区分"}]
[null,"列記号４",null,null,null,null,null,null,null,{"$f":"IF(C15=\"\",\"\",ASC(C15))","v":""},"","","","","","リンク元列名とリンク先列名の選択リスト",null,null,null,null,null,null,null,null,null,null,null,null,null,null,"肥料台帳",6,{"$f":"IF(ほ場台帳!E$3=\"\",\"\",ほ場台帳!E$3)","v":"地番"},{"$f":"IF(作業台帳!E$4=\"\",\"\",作業台帳!E$4)","v":""},{"$f":"IF(機械台帳!E$4=\"\",\"\",機械台帳!E$4)","v":""},{"$f":"IF(農薬台帳!E$4=\"\",\"\",農薬台帳!E$4)","v":""},{"$f":"IF(肥料台帳!E$4=\"\",\"\",肥料台帳!E$4)","v":""}]
["１セル複数データの処理",null,null,null,null,null,null,null,null,null,null,null,null,null,null,"項目1","項目2","項目3","項目4","項目5","項目6",null,"項目1","項目2","項目3","項目4","項目5","項目6",null,null,null,7,{"$f":"IF(ほ場台帳!F$3=\"\",\"\",ほ場台帳!F$3)","v":"面積"},{"$f":"IF(作業台帳!F$4=\"\",\"\",作業台帳!F$4)","v":""},{"$f":"IF(機械台帳!F$4=\"\",\"\",機械台帳!F$4)","v":""},{"$f":"IF(農薬台帳!F$4=\"\",\"\",農薬台帳!F$4)","v":""},{"$f":"IF(肥料台帳!F$4=\"\",\"\",肥料台帳!F$4)","v":""}]
["リンク\n（列記号１）","台帳名",null,null,null,null,null,null,null,null,null,null,null,null,null,null,null,null,null,null,null,null,null,null,null,null,null,null,null,null,null,8,{"$f":"IF(ほ場台帳!G$3=\"\",\"\",ほ場台帳!G$3)","v":"品種"},{"$f":"IF(作業台帳!G$4=\"\",\"\",作業台帳!G$4)","v":""},{"$f":"IF(機械台帳!G$4=\"\",\"\",機械台帳!G$4)","v":""},{"$f":"IF(農薬台帳!G$4=\"\",\"\",農薬台帳!G$4)","v":""},{"$f":"IF(肥料台帳!G$4=\"\",\"\",肥料台帳!G$4)","v":""}]
[null,"リンク元列名",null,null,null,null,null,null,null,null,null,null,null,null,null,{"$f":"IF(C$17=\"\",\"\",HLOOKUP(C$17,$AG$10:$AL$30,$AF11,0))","v":""},{"$f":"IF(D$17=\"\",\"\",HLOOKUP(D$17,$AG$10:$AL$30,$AF11,0))","v":""},{"$f":"IF(E$17=\"\",\"\",HLOOKUP(E$17,$AG$10:$AL$30,$AF11,0))","v":""},{"$f":"IF(F$17=\"\",\"\",HLOOKUP(F$17,$AG$10:$AL$30,$AF11,0))","v":""},{"$f":"IF(G$17=\"\",\"\",HLOOKUP(G$17,$AG$10:$AL$30,$AF11,0))","v":""},{"$f":"IF(H$17=\"\",\"\",HLOOKUP(H$17,$AG$10:$AL$30,$AF11,0))","v":""},null,{"$f":"IF(C$20=\"\",\"\",HLOOKUP(C$20,$AG$10:$AL$30,$AF11,0))","v":""},{"$f":"IF(D$20=\"\",\"\",HLOOKUP(D$20,$AG$10:$AL$30,$AF11,0))","v":""},{"$f":"IF(E$20=\"\",\"\",HLOOKUP(E$20,$AG$10:$AL$30,$AF11,0))","v":""},{"$f":"IF(F$20=\"\",\"\",HLOOKUP(F$20,$AG$10:$AL$30,$AF11,0))","v":""},{"$f":"IF(G$20=\"\",\"\",HLOOKUP(G$20,$AG$10:$AL$30,$AF11,0))","v":""},{"$f":"IF(H$20=\"\",\"\",HLOOKUP(H$20,$AG$10:$AL$30,$AF11,0))","v":""},null,null,null,9,{"$f":"IF(ほ場台帳!H$3=\"\",\"\",ほ場台帳!H$3)","v":""},{"$f":"IF(作業台帳!H$4=\"\",\"\",作業台帳!H$4)","v":""},{"$f":"IF(機械台帳!H$4=\"\",\"\",機械台帳!H$4)","v":""},{"$f":"IF(農薬台帳!H$4=\"\",\"\",農薬台帳!H$4)","v":""},{"$f":"IF(肥料台帳!H$4=\"\",\"\",肥料台帳!H$4)","v":""}]
[null,"リンク先列名",null,null,null,null,null,null,null,null,null,null,null,null,null,"","","","","","",null,"","","","","","",null,null,null,10,{"$f":"IF(ほ場台帳!I$3=\"\",\"\",ほ場台帳!I$3)","v":""},{"$f":"IF(作業台帳!I$4=\"\",\"\",作業台帳!I$4)","v":""},{"$f":"IF(機械台帳!I$4=\"\",\"\",機械台帳!I$4)","v":""},{"$f":"IF(農薬台帳!I$4=\"\",\"\",農薬台帳!I$4)","v":""},{"$f":"IF(肥料台帳!I$4=\"\",\"\",肥料台帳!I$4)","v":""}]
["リンク\n（列記号２）","台帳名",null,null,null,null,null,null,null,null,null,null,null,null,null,"","","","","","",null,"","","","","","",null,null,null,11,{"$f":"IF(ほ場台帳!J$3=\"\",\"\",ほ場台帳!J$3)","v":""},{"$f":"IF(作業台帳!J$4=\"\",\"\",作業台帳!J$4)","v":""},{"$f":"IF(機械台帳!J$4=\"\",\"\",機械台帳!J$4)","v":""},{"$f":"IF(農薬台帳!J$4=\"\",\"\",農薬台帳!J$4)","v":""},{"$f":"IF(肥料台帳!J$4=\"\",\"\",肥料台帳!J$4)","v":""}]
[null,"リンク元列名",null,null,null,null,null,null,null,null,null,null,null,null,null,"","","","","","",null,"","","","","","",null,null,null,12,{"$f":"IF(ほ場台帳!K$3=\"\",\"\",ほ場台帳!K$3)","v":""},{"$f":"IF(作業台帳!K$4=\"\",\"\",作業台帳!K$4)","v":""},{"$f":"IF(機械台帳!K$4=\"\",\"\",機械台帳!K$4)","v":""},{"$f":"IF(農薬台帳!K$4=\"\",\"\",農薬台帳!K$4)","v":""},{"$f":"IF(肥料台帳!K$4=\"\",\"\",肥料台帳!K$4)","v":""}]
[null,"リンク先列名",null,null,null,null,null,null,null,null,null,null,null,null,null,"","","","","","",null,"","","","","","",null,null,null,13,{"$f":"IF(ほ場台帳!L$3=\"\",\"\",ほ場台帳!L$3)","v":""},{"$f":"IF(作業台帳!L$4=\"\",\"\",作業台帳!L$4)","v":""},{"$f":"IF(機械台帳!L$4=\"\",\"\",機械台帳!L$4)","v":""},{"$f":"IF(農薬台帳!L$4=\"\",\"\",農薬台帳!L$4)","v":""},{"$f":"IF(肥料台帳!L$4=\"\",\"\",肥料台帳!L$4)","v":""}]
[null,null,null,null,null,null,null,null,null,null,null,null,null,null,null,"","","","","","",null,"","","","","","",null,null,null,14,{"$f":"IF(ほ場台帳!M$3=\"\",\"\",ほ場台帳!M$3)","v":""},{"$f":"IF(作業台帳!M$4=\"\",\"\",作業台帳!M$4)","v":""},{"$f":"IF(機械台帳!M$4=\"\",\"\",機械台帳!M$4)","v":""},{"$f":"IF(農薬台帳!M$4=\"\",\"\",農薬台帳!M$4)","v":""},{"$f":"IF(肥料台帳!M$4=\"\",\"\",肥料台帳!M$4)","v":""}]
[null,null,null,null,null,null,null,null,null,null,null,null,null,null,null,"","","","","","",null,"","","","","","",null,null,null,15,{"$f":"IF(ほ場台帳!N$3=\"\",\"\",ほ場台帳!N$3)","v":""},{"$f":"IF(作業台帳!N$4=\"\",\"\",作業台帳!N$4)","v":""},{"$f":"IF(機械台帳!N$4=\"\",\"\",機械台帳!N$4)","v":""},{"$f":"IF(農薬台帳!N$4=\"\",\"\",農薬台帳!N$4)","v":""},{"$f":"IF(肥料台帳!N$4=\"\",\"\",肥料台帳!N$4)","v":""}]
[null,"列番号１",{"$f":"IF(J12=\"\",0,列番号(J12))","v":0},{"$f":"IF(K12=\"\",0,列番号(K12))","v":0},{"$f":"IF(L12=\"\",0,列番号(L12))","v":0},{"$f":"IF(M12=\"\",0,列番号(M12))","v":0},{"$f":"IF(N12=\"\",0,列番号(N12))","v":0},{"$f":"IF(O12=\"\",0,列番号(O12))","v":0},null,null,null,null,null,null,null,"","","","","","",null,"","","","","","",null,null,null,16,{"$f":"IF(ほ場台帳!O$3=\"\",\"\",ほ場台帳!O$3)","v":""},{"$f":"IF(作業台帳!O$4=\"\",\"\",作業台帳!O$4)","v":""},{"$f":"IF(機械台帳!O$4=\"\",\"\",機械台帳!O$4)","v":""},{"$f":"IF(農薬台帳!O$4=\"\",\"\",農薬台帳!O$4)","v":""},{"$f":"IF(肥料台帳!O$4=\"\",\"\",肥料台帳!O$4)","v":""}]
[null,"列番号２",{"$f":"IF(J13=\"\",0,列番号(J13))","v":0},{"$f":"IF(K13=\"\",0,列番号(K13))","v":0},{"$f":"IF(L13=\"\",0,列番号(L13))","v":0},{"$f":"IF(M13=\"\",0,列番号(M13))","v":0},{"$f":"IF(N13=\"\",0,列番号(N13))","v":0},{"$f":"IF(O13=\"\",0,列番号(O13))","v":0},null,null,null,null,null,null,null,"","","","","","",null,"","","","","","",null,null,null,17,{"$f":"IF(ほ場台帳!P$3=\"\",\"\",ほ場台帳!P$3)","v":""},{"$f":"IF(作業台帳!P$4=\"\",\"\",作業台帳!P$4)","v":""},{"$f":"IF(機械台帳!P$4=\"\",\"\",機械台帳!P$4)","v":""},{"$f":"IF(農薬台帳!P$4=\"\",\"\",農薬台帳!P$4)","v":""},{"$f":"IF(肥料台帳!P$4=\"\",\"\",肥料台帳!P$4)","v":""}]
[null,"列番号３",{"$f":"IF(J14=\"\",0,列番号(J14))","v":0},{"$f":"IF(K14=\"\",0,列番号(K14))","v":0},{"$f":"IF(L14=\"\",0,列番号(L14))","v":0},{"$f":"IF(M14=\"\",0,列番号(M14))","v":0},{"$f":"IF(N14=\"\",0,列番号(N14))","v":0},{"$f":"IF(O14=\"\",0,列番号(O14))","v":0},null,null,null,null,null,null,null,"","","","","","",null,"","","","","","",null,null,null,18,{"$f":"IF(ほ場台帳!Q$3=\"\",\"\",ほ場台帳!Q$3)","v":""},{"$f":"IF(作業台帳!Q$4=\"\",\"\",作業台帳!Q$4)","v":""},{"$f":"IF(機械台帳!Q$4=\"\",\"\",機械台帳!Q$4)","v":""},{"$f":"IF(農薬台帳!Q$4=\"\",\"\",農薬台帳!Q$4)","v":""},{"$f":"IF(肥料台帳!Q$4=\"\",\"\",肥料台帳!Q$4)","v":""}]
[null,"列番号４",{"$f":"IF(J15=\"\",0,列番号(J15))","v":0},{"$f":"IF(K15=\"\",0,列番号(K15))","v":0},{"$f":"IF(L15=\"\",0,列番号(L15))","v":0},{"$f":"IF(M15=\"\",0,列番号(M15))","v":0},{"$f":"IF(N15=\"\",0,列番号(N15))","v":0},{"$f":"IF(O15=\"\",0,列番号(O15))","v":0},null,null,null,null,null,null,null,"","","","","","",null,"","","","","","",null,null,null,19,{"$f":"IF(ほ場台帳!R$3=\"\",\"\",ほ場台帳!R$3)","v":""},{"$f":"IF(作業台帳!R$4=\"\",\"\",作業台帳!R$4)","v":""},{"$f":"IF(機械台帳!R$4=\"\",\"\",機械台帳!R$4)","v":""},{"$f":"IF(農薬台帳!R$4=\"\",\"\",農薬台帳!R$4)","v":""},{"$f":"IF(肥料台帳!R$4=\"\",\"\",肥料台帳!R$4)","v":""}]
[null,"リンク元列記号",{"$f":"列記号(C18,P18:P41)","v":""},"","","","","",null,null,null,null,null,null,null,"","","","","","",null,"","","","","","",null,null,null,20,{"$f":"IF(ほ場台帳!S$3=\"\",\"\",ほ場台帳!S$3)","v":""},{"$f":"IF(作業台帳!S$4=\"\",\"\",作業台帳!S$4)","v":""},{"$f":"IF(機械台帳!S$4=\"\",\"\",機械台帳!S$4)","v":""},{"$f":"IF(農薬台帳!S$4=\"\",\"\",農薬台帳!S$4)","v":""},{"$f":"IF(肥料台帳!S$4=\"\",\"\",肥料台帳!S$4)","v":""}]
[null,"リンク元列番号",{"$f":"IF(C29=\"\",0,列番号(C29))","v":0},{"$f":"IF(D29=\"\",0,列番号(D29))","v":0},{"$f":"IF(E29=\"\",0,列番号(E29))","v":0},{"$f":"IF(F29=\"\",0,列番号(F29))","v":0},{"$f":"IF(G29=\"\",0,列番号(G29))","v":0},{"$f":"IF(H29=\"\",0,列番号(H29))","v":0},null,null,null,null,null,null,null,"","","","","","",null,"","","","","","",null,null,null,21,{"$f":"IF(ほ場台帳!T$3=\"\",\"\",ほ場台帳!T$3)","v":""},{"$f":"IF(作業台帳!T$4=\"\",\"\",作業台帳!T$4)","v":""},{"$f":"IF(機械台帳!T$4=\"\",\"\",機械台帳!T$4)","v":""},{"$f":"IF(農薬台帳!T$4=\"\",\"\",農薬台帳!T$4)","v":""},{"$f":"IF(肥料台帳!T$4=\"\",\"\",肥料台帳!T$4)","v":""}]
[null,"リンク先列記号",{"$f":"列記号(C19,P18:P41)","v":""},"","","","","",null,null,null,null,null,null,null,"","","","","","",null,"","","","","",""]
[null,"リンク先列番号",{"$f":"IF(C31=\"\",0,列番号(C31))","v":0},{"$f":"IF(D31=\"\",0,列番号(D31))","v":0},{"$f":"IF(E31=\"\",0,列番号(E31))","v":0},{"$f":"IF(F31=\"\",0,列番号(F31))","v":0},{"$f":"IF(G31=\"\",0,列番号(G31))","v":0},{"$f":"IF(H31=\"\",0,列番号(H31))","v":0},null,null,null,null,null,null,null,"","","","","","",null,"","","","","",""]
[null,"リンク元列記号",{"$f":"列記号(C21,W18:W41)","v":""},"","","","","",null,null,null,null,null,null,null,"","","","","","",null,"","","","","",""]
[null,"リンク元列番号",{"$f":"IF(C33=\"\",0,列番号(C33))","v":0},{"$f":"IF(D33=\"\",0,列番号(D33))","v":0},{"$f":"IF(E33=\"\",0,列番号(E33))","v":0},{"$f":"IF(F33=\"\",0,列番号(F33))","v":0},{"$f":"IF(G33=\"\",0,列番号(G33))","v":0},{"$f":"IF(H33=\"\",0,列番号(H33))","v":0},null,null,null,null,null,null,null,"","","","","","",null,"","","","","",""]
[null,"リンク先列記号",{"$f":"列記号(C22,W18:W41)","v":""},"","","","","",null,null,null,null,null,null,null,"","","","","","",null,"","","","","",""]
[null,"リンク先列番号",{"$f":"IF(C35=\"\",0,列番号(C35))","v":0},{"$f":"IF(D35=\"\",0,列番号(D35))","v":0},{"$f":"IF(E35=\"\",0,列番号(E35))","v":0},{"$f":"IF(F35=\"\",0,列番号(F35))","v":0},{"$f":"IF(G35=\"\",0,列番号(G35))","v":0},{"$f":"IF(H35=\"\",0,列番号(H35))","v":0},null,null,null,null,null,null,null,"","","","","","",null,"","","","","",""]
[null,null,null,null,null,null,null,null,null,null,null,null,null,null,null,"","","","","","",null,"","","","","",""]
[]
[]
["工程区分２"]
{"$rows_left_out":138}
{"sheet":"台帳作成","index":4,"n_rows":1087,"n_cols":38,"rows_kept":1087,"cut":false,"hidden":false,"merged":[[3,0,3,1],[3,7,3,8],[0,0,1,4],[0,7,1,11],[2,14,2,16],[1,14,1,16]]}
["「データ１」シートからの台帳作成",null,null,null,null,null,null,"「データ２」シートからの台帳作成"]
[null,null,null,null,null,null,null,null,null,null,null,null,null,null,"１セルに複数データが入力されている場合"]
[null,null,null,null,null,null,null,null,null,null,null,null,null,null,"区切り文字として使用"]
["データ開始行",null,null,null,null,null,null,"データ開始行",null,null,null,null,null,null,null,"改行","する"]
[null,null,"重要：この行からデータを読み込みます。",null,null,null,null,null,null,"重要：この行からデータを読み込みます。",null,null,null,null,",","半角ｶﾝﾏ","する"]
[null,null,null,null,null,null,null,null,null,null,null,null,null,null,"，","全角ｶﾝﾏ","する"]
[null,null,null,null,null,null,null,null,null,null,null,null,null,null,"､","半角読点","する"]
["品種台帳作成",null,null,null,null,null,null,"品種作業台帳作成",null,null,null,null,null,null,"、","全角読点","する"]
[null,"品種名",null,null,null,null,null,null,"品種名",null,null,null,null,null,"/","半角ｽﾗｯｼｭ","する"]
["列記号",null,null,null,null,null,null,"列記号",null,null,null,null,null,null,"／","全角ｽﾗｯｼｭ","する",{"$f":"IF(B10=\"\",\"\",ASC(B10))","v":""},null,null,null,null,null,null,{"$f":"IF(I10=\"\",\"\",ASC(I10))","v":""}]
["列番号",{"$f":"IF(R10=\"\",0,列番号(R10))","v":0},null,null,null,null,null,"列番号",{"$f":"IF(Y10=\"\",0,列番号(Y10))","v":0}]
[]
[]
["ほ場台帳作成",null,null,null,null,null,null,"ほ場台帳作成"]
[null,"ほ場番号","ほ場名","地番","面積","品種",null,null,"ほ場番号","ほ場名","地番","面積","品種"]
["列記号",null,null,null,null,null,null,"列記号",null,null,null,null,null,null,null,null,null,{"$f":"IF(B16=\"\",\"\",ASC(B16))","v":""},{"$f":"IF(C16=\"\",\"\",ASC(C16))","v":""},"","","",null,null,{"$f":"IF(I16=\"\",\"\",ASC(I16))","v":""},{"$f":"IF(J16=\"\",\"\",ASC(J16))","v":""},{"$f":"IF(K16=\"\",\"\",ASC(K16))","v":""},"",""]
["列番号",{"$f":"IF(R16=\"\",0,列番号(R16))","v":0},{"$f":"IF(S16=\"\",0,列番号(S16))","v":0},{"$f":"IF(T16=\"\",0,列番号(T16))","v":0},{"$f":"IF(U16=\"\",0,列番号(U16))","v":0},{"$f":"IF(V16=\"\",0,列番号(V16))","v":0},null,"列番号",{"$f":"IF(Y16=\"\",0,列番号(Y16))","v":0},{"$f":"IF(Z16=\"\",0,列番号(Z16))","v":0},{"$f":"IF(AA16=\"\",0,列番号(AA16))","v":0},{"$f":"IF(AB16=\"\",0,列番号(AB16))","v":0},{"$f":"IF(AC16=\"\",0,列番号(AC16))","v":0}]
[null,"重要：この項目で、ほ場を識別します。",null,null,null,null,null,null,"重要：この項目で、ほ場を識別します。"]
[]
["作業台帳作成",null,null,null,null,null,null,"作業台帳作成"]
[null,"作業名",null,null,null,null,null,null,"作業名"]
["列記号",null,null,null,null,null,null,"列記号",null,null,null,null,null,null,null,null,null,{"$f":"IF(B22=\"\",\"\",ASC(B22))","v":""},null,null,null,null,null,null,{"$f":"IF(I22=\"\",\"\",ASC(I22))","v":""}]
["列番号",{"$f":"IF(R22=\"\",0,列番号(R22))","v":0},null,null,null,null,null,"列番号",{"$f":"IF(Y22=\"\",0,列番号(Y22))","v":0}]
[]
[]
["機械台帳作成",null,null,null,null,null,null,"機械台帳作成"]
[null,"機械名",null,null,null,null,null,null,"機械名"]
["列記号",null,null,null,null,null,null,"列記号",null,null,null,null,null,null,null,null,null,{"$f":"IF(B28=\"\",\"\",ASC(B28))","v":""},null,null,null,null,null,null,{"$f":"IF(I28=\"\",\"\",ASC(I28))","v":""}]
["列番号",{"$f":"IF(R28=\"\",0,列番号(R28))","v":0},null,null,null,null,null,"列番号",{"$f":"IF(Y28=\"\",0,列番号(Y28))","v":0}]
[]
[]
["農薬台帳",null,null,null,null,null,null,"農薬台帳"]
[null,"農薬名1","農薬名2","農薬名3","農薬名4",null,null,null,"農薬名1","農薬名2","農薬名3","農薬名4"]
["列記号",null,null,null,null,null,null,"列記号",null,null,null,null,null,null,null,null,null,{"$f":"IF(B34=\"\",\"\",ASC(B34))","v":""},"","","",null,null,null,{"$f":"IF(I34=\"\",\"\",ASC(I34))","v":""},{"$f":"IF(J34=\"\",\"\",ASC(J34))","v":""},{"$f":"IF(K34=\"\",\"\",ASC(K34))","v":""},{"$f":"IF(L34=\"\",\"\",ASC(L34))","v":""}]
["列番号",{"$f":"IF(R34=\"\",0,列番号(R34))","v":0},{"$f":"IF(S34=\"\",0,列番号(S34))","v":0},{"$f":"IF(T34=\"\",0,列番号(T34))","v":0},{"$f":"IF(U34=\"\",0,列番号(U34))","v":0},null,null,"列番号",{"$f":"IF(Y34=\"\",0,列番号(Y34))","v":0},{"$f":"IF(Z34=\"\",0,列番号(Z34))","v":0},{"$f":"IF(AA34=\"\",0,列番号(AA34))","v":0},{"$f":"IF(AB34=\"\",0,列番号(AB34))","v":0}]
[]
[]
["肥料台帳",null,null,null,null,null,null,"肥料台帳"]
[null,"肥料名1","肥料名2","肥料名3","肥料名4",null,null,null,"肥料名1","肥料名2","肥料名3","肥料名4"]
["列記号",null,null,null,null,null,null,"列記号",null,null,null,null,null,null,null,null,null,{"$f":"IF(B40=\"\",\"\",ASC(B40))","v":""},"","","",null,null,null,{"$f":"IF(I40=\"\",\"\",ASC(I40))","v":""},{"$f":"IF(J40=\"\",\"\",ASC(J40))","v":""},{"$f":"IF(K40=\"\",\"\",ASC(K40))","v":""},{"$f":"IF(L40=\"\",\"\",ASC(L40))","v":""}]
{"$rows_left_out":1048}
{"sheet":"品種台帳","index":5,"n_rows":3,"n_cols":3,"rows_kept":3,"cut":false,"hidden":false,"merged":[]}
[]
[]
["データ１","データ２","品種名"]

{"sheet":"ほ場台帳","index":6,"n_rows":3,"n_cols":7,"rows_kept":3,"cut":false,"hidden":false,"merged":[]}
[]
[]
["データ１","データ２","ほ場番号","ほ場名","地番","面積","品種"]

{"sheet":"作業台帳","index":7,"n_rows":4,"n_cols":4,"rows_kept":4,"cut":false,"hidden":false,"merged":[]}
[]
[]
[]
["データ１","データ２","作業名","機械名"]

{"sheet":"機械台帳","index":8,"n_rows":4,"n_cols":3,"rows_kept":4,"cut":false,"hidden":false,"merged":[]}
[]
[]
[]
["データ１","データ２","機械名"]

{"sheet":"農薬台帳","index":9,"n_rows":4,"n_cols":4,"rows_kept":4,"cut":false,"hidden":false,"merged":[]}
[null,0]
[]
[]
["データ１","データ２","農薬名","区分"]

{"sheet":"肥料台帳","index":10,"n_rows":4,"n_cols":4,"rows_kept":4,"cut":false,"hidden":false,"merged":[]}
[]
[]
[]
["データ１","データ２","肥料名","区分"]

{"sheet":"生産履歴票設定保存","index":11,"n_rows":6,"n_cols":447,"rows_kept":6,"cut":false,"hidden":false,"merged":[]}
[]
["フォーマット名に空白があった場合には、その行以降のデータは読み込むことができなくなります。"]
["フォーマット名","工程区分１",null,null,null,null,null,null,null,null,null,null,null,null,null,null,null,null,null,null,null,null,null,null,null,null,null,null,null,null,null,null,null,null,null,null,null,null,null,null,null,null,null,null,null,null,null,null,null,null,null,null,null,null,null,null,null,null,null,null,null,null,null,null,null,null,null,null,null,null,null,null,null,null,null,null,null,null,null,null,null,null,null,null,null,null,null,null,null,"工程区分２",null,null,null,null,null,null,null,null,null,null,null,null,null,null,null,null,null,null,null,null,null,null,null,null,null,null,null,null,null,null,null,null,null,null,null,null,null,null,null,null,null,null,null,null,null,null,null,null,null,null,null,null,null,null,null,null,null,null,null,null,null,null,null,null,null,null,null,null,null,null,null,null,null,null,null,null,null,null,null,null,null,null,null,null,null,null,null,"工程区分３",null,null,null,null,null,null,null,null,null,null,null,null,null,null,null,null,null,null,null,null,null,null,null,null,null,null,null,null,null,null,null,null,null,null,null,null,null,null,null,null,null,null,null,null,null,null,null,null,null,null,null,null,null,null,null,null,null,null,null,null,null,null,null,null,null,null,null,null,null,null,null,null,null,null,null,null,null,null,null,null,null,null,null,null,null,null,null,"工程区分４",null,null,null,null,null,null,null,null,null,null,null,null,null,null,null,null,null,null,null,null,null,null,null,null,null,null,null,null,null,null,null,null,null,null,null,null,null,null,null,null,null,null,null,null,null,null,null,null,null,null,null,null,null,null,null,null,null,null,null,null,null,null,null,null,null,null,null,null,null,null,null,null,null,null,null,null,null,null,null,null,null,null,null,null,null,null,null,"工程区分５"]
[null,"工程区分名","データシート","対象作業-1","対象作業-2","対象作業-3","対象作業-4","対象作業-5","対象作業-6","対象作業-7","対象作業-8","対象作業-9","対象作業-10","対象作業-11","対象作業-12","対象作業-13","対象作業-14","項目-1","項目-2","項目-3","項目-4","項目-5","項目-6","列記号１-1","列記号１-2","列記号１-3","列記号１-4","列記号１-5","列記号１-6","列記号２-1","列記号２-2","列記号２-3","列記号２-4","列記号２-5","列記号２-6","列記号３-1","列記号３-2","列記号３-3","列記号３-4","列記号３-5","列記号３-6","列記号４-1","列記号４-2","列記号４-3","列記号４-4","列記号４-5","列記号４-6","複数データ-1","複数データ-2","複数データ-3","複数データ-4","複数データ-5","複数データ-6","リンク１台帳名-1","リンク１台帳名-2","リンク１台帳名-3","リンク１台帳名-4","リンク１台帳名-5","リンク１台帳名-6","リンク１元列名-1","リンク１元列名-2","リンク１元列名-3","リンク１元列名-4","リンク１元列名-5","リンク１元列名-6","リンク１先列名-1","リンク１先列名-2","リンク１先列名-3","リンク１先列名-4","リンク１先列名-5","リンク１先列名-6","リンク２台帳名-1","リンク２台帳名-2","リンク２台帳名-3","リンク２台帳名-4","リンク２台帳名-5","リンク２台帳名-6","リンク２元列名-1","リンク２元列名-2","リンク２元列名-3","リンク２元列名-4","リンク２元列名-5","リンク２元列名-6","リンク２先列名-1","リンク２先列名-2","リンク２先列名-3","リンク２先列名-4","リンク２先列名-5","リンク２先列名-6","工程区分名","データシート","対象作業-1","対象作業-2","対象作業-3","対象作業-4","対象作業-5","対象作業-6","対象作業-7","対象作業-8","対象作業-9","対象作業-10","対象作業-11","対象作業-12","対象作業-13","対象作業-14","項目-1","項目-2","項目-3","項目-4","項目-5","項目-6","列記号１-1","列記号１-2","列記号１-3","列記号１-4","列記号１-5","列記号１-6","列記号２-1","列記号２-2","列記号２-3","列記号２-4","列記号２-5","列記号２-6","列記号３-1","列記号３-2","列記号３-3","列記号３-4","列記号３-5","列記号３-6","列記号４-1","列記号４-2","列記号４-3","列記号４-4","列記号４-5","列記号４-6","複数データ-1","複数データ-2","複数データ-3","複数データ-4","複数データ-5","複数データ-6","リンク１台帳名-1","リンク１台帳名-2","リンク１台帳名-3","リンク１台帳名-4","リンク１台帳名-5","リンク１台帳名-6","リンク１元列名-1","リンク１元列名-2","リンク１元列名-3","リンク１元列名-4","リンク１元列名-5","リンク１元列名-6","リンク１先列名-1","リンク１先列名-2","リンク１先列名-3","リンク１先列名-4","リンク１先列名-5","リンク１先列名-6","リンク２台帳名-1","リンク２台帳名-2","リンク２台帳名-3","リンク２台帳名-4","リンク２台帳名-5","リンク２台帳名-6","リンク２元列名-1","リンク２元列名-2","リンク２元列名-3","リンク２元列名-4","リンク２元列名-5","リンク２元列名-6","リンク２先列名-1","リンク２先列名-2","リンク２先列名-3","リンク２先列名-4","リンク２先列名-5","リンク２先列名-6","工程区分名","データシート","対象作業-1","対象作業-2","対象作業-3","対象作業-4","対象作業-5","対象作業-6","対象作業-7","対象作業-8","対象作業-9","対象作業-10","対象作業-11","対象作業-12","対象作業-13","対象作業-14","項目-1","項目-2","項目-3","項目-4","項目-5","項目-6","列記号１-1","列記号１-2","列記号１-3","列記号１-4","列記号１-5","列記号１-6","列記号２-1","列記号２-2","列記号２-3","列記号２-4","列記号２-5","列記号２-6","列記号３-1","列記号３-2","列記号３-3","列記号３-4","列記号３-5","列記号３-6","列記号４-1","列記号４-2","列記号４-3","列記号４-4","列記号４-5","列記号４-6","複数データ-1","複数データ-2","複数データ-3","複数データ-4","複数データ-5","複数データ-6","リンク１台帳名-1","リンク１台帳名-2","リンク１台帳名-3","リンク１台帳名-4","リンク１台帳名-5","リンク１台帳名-6","リンク１元列名-1","リンク１元列名-2","リンク１元列名-3","リンク１元列名-4","リンク１元列名-5","リンク１元列名-6","リンク１先列名-1","リンク１先列名-2","リンク１先列名-3","リンク１先列名-4","リンク１先列名-5","リンク１先列名-6","リンク２台帳名-1","リンク２台帳名-2","リンク２台帳名-3","リンク２台帳名-4","リンク２台帳名-5","リンク２台帳名-6","リンク２元列名-1","リンク２元列名-2","リンク２元列名-3","リンク２元列名-4","リンク２元列名-5","リンク２元列名-6","リンク２先列名-1","リンク２先列名-2","リンク２先列名-3","リンク２先列名-4","リンク２先列名-5","リンク２先列名-6","工程区分名","データシート","対象作業-1","対象作業-2","対象作業-3","対象作業-4","対象作業-5","対象作業-6","対象作業-7","対象作業-8","対象作業-9","対象作業-10","対象作業-11","対象作業-12","対象作業-13","対象作業-14","項目-1","項目-2","項目-3","項目-4","項目-5","項目-6","列記号１-1","列記号１-2","列記号１-3","列記号１-4","列記号１-5","列記号１-6","列記号２-1","列記号２-2","列記号２-3","列記号２-4","列記号２-5","列記号２-6","列記号３-1","列記号３-2","列記号３-3","列記号３-4","列記号３-5","列記号３-6","列記号４-1","列記号４-2","列記号４-3","列記号４-4","列記号４-5","列記号４-6","複数データ-1","複数データ-2","複数データ-3","複数データ-4","複数データ-5","複数データ-6","リンク１台帳名-1","リンク１台帳名-2","リンク１台帳名-3","リンク１台帳名-4","リンク１台帳名-5","リンク１台帳名-6","リンク１元列名-1","リンク１元列名-2","リンク１元列名-3","リンク１元列名-4","リンク１元列名-5","リンク１元列名-6","リンク１先列名-1","リンク１先列名-2","リンク１先列名-3","リンク１先列名-4","リンク１先列名-5","リンク１先列名-6","リンク２台帳名-1","リンク２台帳名-2","リンク２台帳名-3","リンク２台帳名-4","リンク２台帳名-5","リンク２台帳名-6","リンク２元列名-1","リンク２元列名-2","リンク２元列名-3","リンク２元列名-4","リンク２元列名-5","リンク２元列名-6","リンク２先列名-1","リンク２先列名-2","リンク２先列名-3","リンク２先列名-4","リンク２先列名-5","リンク２先列名-6","工程区分名","データシート","対象作業-1","対象作業-2","対象作業-3","対象作業-4","対象作業-5","対象作業-6","対象作業-7","対象作業-8","対象作業-9","対象作業-10","対象作業-11","対象作業-12","対象作業-13","対象作業-14","項目-1","項目-2","項目-3","項目-4","項目-5","項目-6","列記号１-1","列記号１-2","列記号１-3","列記号１-4","列記号１-5","列記号１-6","列記号２-1","列記号２-2","列記号２-3","列記号２-4","列記号２-5","列記号２-6","列記号３-1","列記号３-2","列記号３-3","列記号３-4","列記号３-5","列記号３-6","列記号４-1","列記号４-2","列記号４-3","列記号４-4","列記号４-5","列記号４-6","複数データ-1","複数データ-2","複数データ-3","複数データ-4","複数データ-5","複数データ-6","リンク１台帳名-1","リンク１台帳名-2","リンク１台帳名-3","リンク１台帳名-4","リンク１台帳名-5","リンク１台帳名-6","リンク１元列名-1","リンク１元列名-2","リンク１元列名-3","リンク１元列名-4","リンク１元列名-5","リンク１元列名-6","リンク１先列名-1","リンク１先列名-2","リンク１先列名-3","リンク１先列名-4","リンク１先列名-5","リンク１先列名-6","リンク２台帳名-1","リンク２台帳名-2","リンク２台帳名-3","リンク２台帳名-4","リンク２台帳名-5","リンク２台帳名-6","リンク２元列名-1","リンク２元列名-2","リンク２元列名-3","リンク２元列名-4","リンク２元列名-5","リンク２元列名-6","リンク２先列名-1","リンク２先列名-2","リンク２先列名-3","リンク２先列名-4","リンク２先列名-5","リンク２先列名-6","列幅-1","列幅-2","列幅-3","列幅-4","列幅-5","列幅-6"]
["新規作成"]
["新しい名前で保存"]

{"sheet":"作業用","index":12,"n_rows":1,"n_cols":2,"rows_kept":1,"cut":false,"hidden":false,"merged":[]}
[null,"ほ場選択リスト"]